{"text_format":"1","workbook":"xlsx","n_sheets":5,"sheets":["Guidance","Pre Defined Duties","Duties","Standards Source Data","Pre-Defined Duties Source Data"],"not_rendered":{"charts":0,"images":0,"macros":1,"external_links":1,"defined_names":7,"comments":0,"pivot_tables":0},"unopened":[],"bounds":{"document_bytes":16777216,"sheet_cells":100000,"rows_first":2000,"rows_last":500,"rows_between":2000,"halvings":0,"cell_chars":16384,"cell_head_chars":4096},"cells_cut":0,"cells_raw":0,"read":"whole","date_system":"1900"}

{"sheet":"Guidance","index":0,"n_rows":51,"n_cols":3,"rows_kept":51,"cut":false,"hidden":false,"merged":[]}
["Guidance to Mapping KSBs Against Duties in Additional Specialist Qualifications","Locations","Guidance"]
["Please complete one spreadsheet for each additional specialist qualification you are submitting","N/A","N/A"]
["Prior to completing any of the tabs in the additional specialist mapping template, please read the Content coverage and mapping criteria - what your application must demonstrate.","N/A","N/A"]
["Choosing Correct Tab","Locations","Guidance"]
["If your qualification maps to one of the pre-defined specialist areas, choose the 'Pre Defined Duties Tab'","Pre defined duties tab"]
["If your qualification does not map to a pre-defined area, choose the 'Duties Tab'","Duties tab"]
["Completing Mapping Pre Defined Duties","Locations","Guidance"]
["Please type the name of awarding body/applicant ","A3","N/A"]
["Please type your qualification title ","A5","N/A"]
["Please provide a summary of how the qualification intends to build on the linked standard to provide specialist competence in the occupational area:","B2","N/A"]
["Please select the standard(s) that your qualification maps to","A-D7","N/A"]
["Please select the pre-defined area from the drop down list","A11-34 ","N/A"]
["Please select the pre-defined sub area from the drop down list","B11-34","N/A"]
["Please select the pre-defined duties in your qualification from the drop down list","C11-34","Duty or duties – the activities/competencies that will be carried out by a competent person in a specific occupation; requires the application of knowledge, skills and behaviours in the workplace. Duties always begin with a verb. "]
["If you have amended or removed the duty please list the amended duty or the removed duty ","D11-34","N/A"]
["Please explain why you have amended or removed a duty","E11-34","N/A"]
["Please add reference to the location in your specification and sample assessment materials where this duty maps to","F11-34","N/A"]
["List any additional duties as part of the re/development of your qualification (not covered by the pre-defined duties) to support the specialist competence in the area","A36-42","IfATE recognise that additional duties may be identified as in scope during the development process. Where not already agreed by IfATE (via the pre-defined duties), applicants will be required to provide suitable evidence within their employer evidence pack of the need for any newly identified duties within the specialist area. Applicants will be required to demonstrate coherent links between their content and the newly identified duties. "]
["Please explain why these duties have been included","E36-42","Please explain why additional duties have been included, above and beyond the pre-defined ones"]
["Please reference where the employer evidence is to support the duty/content","F36-42","Please provide reference to employer evidence to support the need for additional duties above and beyond the pre-defined ones"]
{"$rows_left_out":32}
{"sheet":"Pre Defined Duties","index":1,"n_rows":60,"n_cols":8,"rows_kept":60,"cut":false,"hidden":false,"merged":[]}
["START HERE"]
["Awarding Body/Applicant:","Please provide a summary of how the qualification intends to build on the linked standard to provide specialist competence in the occupational area:"]
["Please type the name of awarding body/applicant here","Please type your summary here"]
["Qualification Title:"]
["Please type your qualification title here"]
["Linked standard(s)","Linked standard(s)","Linked standard(s)","Linked standard(s)"]
[]
[]
[]
["Select pre-defined area","Select Sub Area","Select Duties","If you have amended or removed the duty, please state amended or removed duty (or add N/A)","Include a rationale for the amendment/deletion here and reference to your employer evidence in your submission","Reference the location in your specification and sample assessment materials where this duty maps to (document title/page reference/section etc (need to be specific as possible))","FOR IFATE USE ONLY\nIM feedback","FOR IFATE USE ONLY\nPR feedback"]
["Please Select","Please select","Please select"]
["Please Select","Please select","Please select"]
["Please Select","Please select","Please select"]
["Please Select","Please select","Please select"]
["Please Select","Please select","Please select"]
["Please Select","Please select","Please select"]
["Please Select","Please select","Please select"]
["Please Select","Please select","Please select"]
["Please Select","Please select","Please select"]
["Please Select","Please select","Please select"]
{"$rows_left_out":41}
{"sheet":"Duties","index":2,"n_rows":45,"n_cols":8,"rows_kept":45,"cut":false,"hidden":false,"merged":[]}
["START HERE"]
["Awarding Body/Applicant:","Please provide a summary of how the qualification intends to build on the linked standard to provide specialist competence in the occupational area:"]
["Please type the name of awarding body/applicant here","Please type your summary here"]
["Qualification Title:"]
["Please type your qualification title here"]
["Linked standard(s)","Linked standard(s)","Linked standard(s)","Linked standard(s)"]
["Please Select","Please Select","Please Select","Please Select"]
[]
[]
["List duties for your qualification below","Reference the location in your specification and sample assessment materials where this duty maps to (document title/page reference/section etc (need to be specific as possible))","Reference to employer evidence in your submission to support the duty/content (document title/page reference/section etc)",null,null,null,"FOR IFATE USE ONLY\nIM feedback","FOR IFATE USE ONLY\nPR feedback"]
[]
[]
[]
[]
[]
[]
[]
[]
[]
[]
{"$rows_left_out":26}
{"sheet":"Standards Source Data","index":3,"n_rows":68,"n_cols":3,"rows_kept":68,"cut":false,"hidden":true,"merged":[]}
["Drop Down Menu - Standard List",null,"Drop Down Menu - KSB COVERAGE"]
["Please Select",null,"Please Select"]
["OCC1030 Safeguarding  Support Officer",null,"Fully"]
["OCC0906 Youth support worker",null,"Partially"]
["OCC0006 Lead adult care worker",null,"None"]
["OCC0022 Asbestos analyst and surveyor"]
["OCC0091 Civil engineering technician"]
["OCC0960 Construction support technician"]
["OCC0266 Digital engineering technician"]
["OCC0491 Geospatial survey technician"]
["OCC0741 Landscape technician"]
["OCC0332 Surveying technician"]
["OCC0336 Transport planning technician"]
["OCC1334 Craft Bricklayer"]
["OCC0263 Craft carpentry and joinery"]
["OCC1358 Craft Painter and Decorator"]
["OCC1385 Craft Plasterer"]
["OCC0802 Curtain wall installer"]
["OCC0414 Military engineering construction technician"]
["OCC0521 Industrial thermal insulation technician"]
{"$rows_left_out":49}
{"sheet":"Pre-Defined Duties Source Data","index":4,"n_rows":758,"n_cols":7,"rows_kept":758,"cut":false,"hidden":true,"merged":[]}
["For changes please any new standards/duties to the table in rows A to C -  DO NOT change or delete rows E onwards"]
["Drop Down Menu - Pre-defined area","Drop Down Menu - Select Sub Area","Drop Down Menu - Select Duties",null,null,"DROP DOWN FORMULA - DO NOT DELETE THESE CELLS"]
["Please Select","Please select","Please select"]
["Adapting and Developing Exercise","Adapting exercise for antenatal and post-natal clients ","considers the physical changes which take place during the antenatal and post-natal periods",null,"Conditional Format Error Code","Pre-Defined Areas","SUB AREAS"]
["Adapting and Developing Exercise","Adapting exercise for antenatal and post-natal clients ","promotes the benefits of exercise/physical activity for antenatal and post-natal women",null,{"$f":"IF(ISBLANK('Pre Defined Duties'!B11),\"\",FIND('Pre Defined Duties'!B11,_xlfn.TEXTJOIN(\" \",TRUE,_xlfn.ANCHORARRAY('Pre-Defined Duties Source Data'!G5))))","v":1},{"$f":"_xlfn.UNIQUE(Table1[Drop Down Menu - Pre-defined area])","v":"Please Select"},{"$f":"TRANSPOSE(_xlfn._xlws.FILTER(Table1[Drop Down Menu - Select Sub Area],Table1[Drop Down Menu - Pre-defined area]='Pre Defined Duties'!A11))","v":"Please select"}]
["Adapting and Developing Exercise","Adapting exercise for antenatal and post-natal clients ","supports antenatal and post-natal clients’ exercise",null,{"$f":"IF(ISBLANK('Pre Defined Duties'!B12),\"\",FIND('Pre Defined Duties'!B12,_xlfn.TEXTJOIN(\" \",TRUE,_xlfn.ANCHORARRAY('Pre-Defined Duties Source Data'!G6))))","v":1},"Adapting and Developing Exercise",{"$f":"TRANSPOSE(_xlfn._xlws.FILTER(Table1[Drop Down Menu - Select Sub Area],Table1[Drop Down Menu - Pre-defined area]='Pre Defined Duties'!A12))","v":"Please select"}]
["Adapting and Developing Exercise","Adapting exercise for antenatal and post-natal clients ","considers contraindications to exercise for antenatal and post-natal clients",null,{"$f":"IF(ISBLANK('Pre Defined Duties'!B13),\"\",FIND('Pre Defined Duties'!B13,_xlfn.TEXTJOIN(\" \",TRUE,_xlfn.ANCHORARRAY('Pre-Defined Duties Source Data'!G7))))","v":1},"Coaching and Instruction",{"$f":"TRANSPOSE(_xlfn._xlws.FILTER(Table1[Drop Down Menu - Select Sub Area],Table1[Drop Down Menu - Pre-defined area]='Pre Defined Duties'!A13))","v":"Please select"}]
["Adapting and Developing Exercise","Adapting exercise for antenatal and post-natal clients ","manages risks in antenatal and post-natal exercise sessions",null,{"$f":"IF(ISBLANK('Pre Defined Duties'!B14),\"\",FIND('Pre Defined Duties'!B14,_xlfn.TEXTJOIN(\" \",TRUE,_xlfn.ANCHORARRAY('Pre-Defined Duties Source Data'!G8))))","v":1},"Sports Massage",{"$f":"TRANSPOSE(_xlfn._xlws.FILTER(Table1[Drop Down Menu - Select Sub Area],Table1[Drop Down Menu - Pre-defined area]='Pre Defined Duties'!A14))","v":"Please select"}]
["Adapting and Developing Exercise","Adapting exercise for antenatal and post-natal clients ","promotes the nutritional requirements for antenatal and post-natal period",null,{"$f":"IF(ISBLANK('Pre Defined Duties'!B15),\"\",FIND('Pre Defined Duties'!B15,_xlfn.TEXTJOIN(\" \",TRUE,_xlfn.ANCHORARRAY('Pre-Defined Duties Source Data'!G9))))","v":1},"Yoga and Pilates-based Matwork",{"$f":"TRANSPOSE(_xlfn._xlws.FILTER(Table1[Drop Down Menu - Select Sub Area],Table1[Drop Down Menu - Pre-defined area]='Pre Defined Duties'!A15))","v":"Please select"}]
["Adapting and Developing Exercise","Adapting exercise for antenatal and post-natal clients ","collects information to plan an exercise programme for antenatal and post-natal clients",null,{"$f":"IF(ISBLANK('Pre Defined Duties'!B16),\"\",FIND('Pre Defined Duties'!B16,_xlfn.TEXTJOIN(\" \",TRUE,_xlfn.ANCHORARRAY('Pre-Defined Duties Source Data'!G10))))","v":1},null,{"$f":"TRANSPOSE(_xlfn._xlws.FILTER(Table1[Drop Down Menu - Select Sub Area],Table1[Drop Down Menu - Pre-defined area]='Pre Defined Duties'!A16))","v":"Please select"}]
["Adapting and Developing Exercise","Adapting exercise for antenatal and post-natal clients ","screens antenatal and post-natal clients prior to planning an exercise programme",null,{"$f":"IF(ISBLANK('Pre Defined Duties'!B17),\"\",FIND('Pre Defined Duties'!B17,_xlfn.TEXTJOIN(\" \",TRUE,_xlfn.ANCHORARRAY('Pre-Defined Duties Source Data'!G11))))","v":1},null,{"$f":"TRANSPOSE(_xlfn._xlws.FILTER(Table1[Drop Down Menu - Select Sub Area],Table1[Drop Down Menu - Pre-defined area]='Pre Defined Duties'!A17))","v":"Please select"}]
["Adapting and Developing Exercise","Adapting exercise for antenatal and post-natal clients ","plans exercise programmes for antenatal and post-natal clients",null,{"$f":"IF(ISBLANK('Pre Defined Duties'!B18),\"\",FIND('Pre Defined Duties'!B18,_xlfn.TEXTJOIN(\" \",TRUE,_xlfn.ANCHORARRAY('Pre-Defined Duties Source Data'!G12))))","v":1},null,{"$f":"TRANSPOSE(_xlfn._xlws.FILTER(Table1[Drop Down Menu - Select Sub Area],Table1[Drop Down Menu - Pre-defined area]='Pre Defined Duties'!A18))","v":"Please select"}]
["Adapting and Developing Exercise","Adapting exercise for independently active older people","considers the ageing process and demographics when planning activities",null,{"$f":"IF(ISBLANK('Pre Defined Duties'!B19),\"\",FIND('Pre Defined Duties'!B19,_xlfn.TEXTJOIN(\" \",TRUE,_xlfn.ANCHORARRAY('Pre-Defined Duties Source Data'!G13))))","v":1},null,{"$f":"TRANSPOSE(_xlfn._xlws.FILTER(Table1[Drop Down Menu - Select Sub Area],Table1[Drop Down Menu - Pre-defined area]='Pre Defined Duties'!A19))","v":"Please select"}]
["Adapting and Developing Exercise","Adapting exercise for independently active older people","makes special considerations when programming and delivering exercise for independently active older people",null,{"$f":"IF(ISBLANK('Pre Defined Duties'!B20),\"\",FIND('Pre Defined Duties'!B20,_xlfn.TEXTJOIN(\" \",TRUE,_xlfn.ANCHORARRAY('Pre-Defined Duties Source Data'!G14))))","v":1},null,{"$f":"TRANSPOSE(_xlfn._xlws.FILTER(Table1[Drop Down Menu - Select Sub Area],Table1[Drop Down Menu - Pre-defined area]='Pre Defined Duties'!A20))","v":"Please select"}]
["Adapting and Developing Exercise","Adapting exercise for independently active older people","promotes the benefits of physical activity and exercise for  independently active, older people",null,{"$f":"IF(ISBLANK('Pre Defined Duties'!B21),\"\",FIND('Pre Defined Duties'!B21,_xlfn.TEXTJOIN(\" \",TRUE,_xlfn.ANCHORARRAY('Pre-Defined Duties Source Data'!G15))))","v":1},null,{"$f":"TRANSPOSE(_xlfn._xlws.FILTER(Table1[Drop Down Menu - Select Sub Area],Table1[Drop Down Menu - Pre-defined area]='Pre Defined Duties'!A21))","v":"Please select"}]
["Adapting and Developing Exercise","Adapting exercise for independently active older people","supports and motivates the independently active older people in exercise",null,{"$f":"IF(ISBLANK('Pre Defined Duties'!B22),\"\",FIND('Pre Defined Duties'!B22,_xlfn.TEXTJOIN(\" \",TRUE,_xlfn.ANCHORARRAY('Pre-Defined Duties Source Data'!G16))))","v":1},null,{"$f":"TRANSPOSE(_xlfn._xlws.FILTER(Table1[Drop Down Menu - Select Sub Area],Table1[Drop Down Menu - Pre-defined area]='Pre Defined Duties'!A22))","v":"Please select"}]
["Adapting and Developing Exercise","Adapting exercise for independently active older people","plans and delivers safe exercise for independently active older people",null,{"$f":"IF(ISBLANK('Pre Defined Duties'!B23),\"\",FIND('Pre Defined Duties'!B23,_xlfn.TEXTJOIN(\" \",TRUE,_xlfn.ANCHORARRAY('Pre-Defined Duties Source Data'!G17))))","v":1},null,{"$f":"TRANSPOSE(_xlfn._xlws.FILTER(Table1[Drop Down Menu - Select Sub Area],Table1[Drop Down Menu - Pre-defined area]='Pre Defined Duties'!A23))","v":"Please select"}]
["Adapting and Developing Exercise","Adapting exercise for independently active older people","plans and conducts pre-exercise consultation with independently active older people",null,{"$f":"IF(ISBLANK('Pre Defined Duties'!B24),\"\",FIND('Pre Defined Duties'!B24,_xlfn.TEXTJOIN(\" \",TRUE,_xlfn.ANCHORARRAY('Pre-Defined Duties Source Data'!G18))))","v":1},null,{"$f":"TRANSPOSE(_xlfn._xlws.FILTER(Table1[Drop Down Menu - Select Sub Area],Table1[Drop Down Menu - Pre-defined area]='Pre Defined Duties'!A24))","v":"Please select"}]
["Adapting and Developing Exercise","Adapting exercise for independently active older people","plans and adapts exercise for independently active older people",null,{"$f":"IF(ISBLANK('Pre Defined Duties'!B25),\"\",FIND('Pre Defined Duties'!B25,_xlfn.TEXTJOIN(\" \",TRUE,_xlfn.ANCHORARRAY('Pre-Defined Duties Source Data'!G19))))","v":1},null,{"$f":"TRANSPOSE(_xlfn._xlws.FILTER(Table1[Drop Down Menu - Select Sub Area],Table1[Drop Down Menu - Pre-defined area]='Pre Defined Duties'!A25))","v":"Please select"}]
["Adapting and Developing Exercise","Adapting exercise for independently active older people","plans a progressive programme of exercise for independently active older people",null,{"$f":"IF(ISBLANK('Pre Defined Duties'!B26),\"\",FIND('Pre Defined Duties'!B26,_xlfn.TEXTJOIN(\" \",TRUE,_xlfn.ANCHORARRAY('Pre-Defined Duties Source Data'!G20))))","v":1},null,{"$f":"TRANSPOSE(_xlfn._xlws.FILTER(Table1[Drop Down Menu - Select Sub Area],Table1[Drop Down Menu - Pre-defined area]='Pre Defined Duties'!A26))","v":"Please select"}]
{"$rows_left_out":738}